BDBM331172 10-Chloro-5-(dimethyl-1H-1,2,3-triazol-5-yl)-8-[(S)-oxan-4-yl(phenyl)methyl]-3,8,11-triazatricyclo[7.4.0.02,7]trideca-1(13),2::US9725449, Example 6
SMILES Cc1nnn(C)c1-c1cnc2c(c1)n([C@@H](C1CCOCC1)c1ccccc1)c1c(Cl)nccc21
InChI Key InChIKey=KXENWSFVHRQDJM-XMMPIXPASA-N
Data  1 IC50
  Tab Delimited (TSV)   2D SDfile   Computed 3D by Vconf -m prep SDfile
Find this compound or compounds like it in BindingDB:
Activity Spreadsheet -- Enzyme Inhibition Constant Data from BindingDB
Found 1 hit for monomerid = 331172
TargetBromodomain-containing protein 4 [1-477]/[333-460]/[44-168]/[44-460](Homo sapiens (Human))
Bristol-Myers Squibb
US Patent
LigandPNGBDBM331172(10-Chloro-5-(dimethyl-1H-1,2,3-triazol-5-yl)-8-[(S...)
Affinity DataIC50: <1nM. Assay description: The binding of compounds to bromodomain BRD4 (44-168), BRD4 (333-460), and BRD4 (1-477 or 44-460) was assessed using a time resolved fluorescent reso...
Ligand InfoPC cidPC sid
In DepthDetails US Patent