BDBM331179 5-(Dimethyl-1H-1,2,3-triazol-5-yl)-10-methoxy-8-[(S)-oxan-4-yl(phenyl)methyl]-3,8,11-triazatricyclo[7.4.0.02,7]trideca-1(13),2::US9725449, Example 13
SMILES COc1nccc2c3ncc(cc3n([C@@H](C3CCOCC3)c3ccccc3)c12)-c1c(C)nnn1C
InChI Key InChIKey=ZWWBHSMAMCEFKN-RUZDIDTESA-N
Data  1 IC50
  Tab Delimited (TSV)   2D SDfile   Computed 3D by Vconf -m prep SDfile
Find this compound or compounds like it in BindingDB:
Activity Spreadsheet -- Enzyme Inhibition Constant Data from BindingDB
Found 1 hit for monomerid = 331179
TargetBromodomain-containing protein 4 [1-477]/[333-460]/[44-168]/[44-460](Homo sapiens (Human))
Bristol-Myers Squibb
US Patent
LigandPNGBDBM331179(5-(Dimethyl-1H-1,2,3-triazol-5-yl)-10-methoxy-8-[(...)
Affinity DataIC50: <1nM. Assay description: The binding of compounds to bromodomain BRD4 (44-168), BRD4 (333-460), and BRD4 (1-477 or 44-460) was assessed using a time resolved fluorescent reso...
Ligand InfoPC cidPC sid
In DepthDetails US Patent