BDBM339556 N-phenyl-4-(thiophen-3-yl)-3-(3-(3-(trifluoromethyl)phenyl)ureido)benzenesulfonamide::US10202339, Compound 351
SMILES FC(F)(F)c1cccc(NC(=O)Nc2cc(ccc2-c2ccsc2)S(=O)(=O)Nc2ccccc2)c1
InChI Key InChIKey=UIJSXEOJNPJHOP-UHFFFAOYSA-N
Data  1 IC50
  Tab Delimited (TSV)   2D SDfile   Computed 3D by Vconf -m prep SDfile
Find this compound or compounds like it in BindingDB:
Activity Spreadsheet -- Enzyme Inhibition Constant Data from BindingDB
Found 1 hit for monomerid = 339556
TargetIsocitrate dehydrogenase [NADP] cytoplasmic [R132H](Homo sapiens (Human))
Agios Pharmaceuticals
US Patent
LigandPNGBDBM339556(N-phenyl-4-(thiophen-3-yl)-3-(3-(3-(trifluoromethy...)
Affinity DataIC50:  5.50E+3nM. Assay description: Assays were conducted in a volume of 76 μl assay buffer (150 mM NaCl, 10 mM MgCl2, 20 mM Tris pH 7.5, 0.03% bovine serum albumin) as follows in ...
Ligand InfoPC cidPC sid
In DepthDetails US Patent