BDBM347054 US10202390, Example 9
SMILES CCCn1cc(cn1)-c1cnc(cc1Nc1cnn(CC(F)F)c1)-c1cnc2cc(Cl)cnn12
InChI Key InChIKey=SWYUCJNNROTAJE-UHFFFAOYSA-N
Data  1 IC50
  Tab Delimited (TSV)   2D SDfile   Computed 3D by Vconf -m prep SDfile
Find this compound or compounds like it in BindingDB:
Activity Spreadsheet -- Enzyme Inhibition Constant Data from BindingDB
Found 1 hit for monomerid = 347054
TargetG protein-activated inward rectifier potassium channel 4(Homo sapiens (Human))
Bristol-Myers Squibb
US Patent
LigandPNGBDBM347054(US10202390, Example 9)
Affinity DataIC50:  29nM. Assay description: TBD
Ligand InfoPC cidPC sid
In DepthDetails US Patent