BDBM35114 biarylether amide quinoline, 4o
SMILES Cc1cnc2c(Cl)cccc2c1-c1cccc(Oc2cccc(c2)C(=O)N2CCCCC2)c1
InChI Key InChIKey=PWFODDIPAXPLMJ-UHFFFAOYSA-N
Data  2 IC50
  Tab Delimited (TSV)   2D SDfile   Computed 3D by Vconf -m prep SDfile
Find this compound or compounds like it in BindingDB:
Activity Spreadsheet -- Enzyme Inhibition Constant Data from BindingDB
Found 2 hits for monomerid = 35114
TargetOxysterols receptor LXR-alpha [197-447](Homo sapiens (Human))
Wyeth Research
LigandPNGBDBM35114(biarylether amide quinoline, 4o)
Affinity DataIC50:  50nM. Assay description: Binding reaction was initiated by adding a dilution series of test compound in tracer solution to LXR-coated flash plates. Each concentration of test...
In DepthDetails ArticlePubMed
TargetOxysterols receptor LXR-beta [154-461](Homo sapiens (Human))
Wyeth Research
LigandPNGBDBM35114(biarylether amide quinoline, 4o)
Affinity DataIC50:  6nMpH: 7.4 T: 2°C. Assay description: Binding reaction was initiated by adding a dilution series of test compound in tracer solution to LXR-coated flash plates. Each concentration of test...
In DepthDetails ArticlePubMed