BDBM352218 US10239868, Entry 22::US10287274, Entry 22::US10676464, Entry 22::US9802924, Entry 22
SMILES O=C1OC(CCN2CCN(CC2)c2ccccc2)CC11CCCCC1
InChI Key InChIKey=JVZAMBNFMNMYOR-UHFFFAOYSA-N
Data  1 IC50
  Tab Delimited (TSV)   2D SDfile   Computed 3D by Vconf -m prep SDfile
Find this compound or compounds like it in BindingDB:
Activity Spreadsheet -- Enzyme Inhibition Constant Data from BindingDB
Found 1 hit for monomerid = 352218
Target5-hydroxytryptamine receptor 7(Homo sapiens (Human))
Temple University
US Patent
LigandPNGBDBM352218(US10239868, Entry 22 | US10287274, Entry 22 | US10...)
Affinity DataIC50:  33nM. Assay description: A stock concentration of 5 nM [3H]LSD (lysergic acid diethyl amide) is prepared in 50 mM Tris-HCl, 10 mM MgCl2, 1 mM EDTA, pH 7.4 (Assay Buffer). Ali...
Ligand InfoPC cidPC sid
In DepthDetails US Patent