BDBM3596 4-[(3-Bromophenyl)amino]-7-methoxypyrido[4,3-d]pyrimidine::CHEMBL53375::N-(3-bromophenyl)-7-methoxypyrido[4,3-d]pyrimidin-4-amine::Pyrido[4,3-d]pyrimidine 5h
SMILES COc1cc2ncnc(Nc3cccc(Br)c3)c2cn1
InChI Key InChIKey=VBKYHRRXRGHYHL-UHFFFAOYSA-N
Data  1 IC50
  Tab Delimited (TSV)   2D SDfile   Computed 3D by Vconf -m prep SDfile
Find this compound or compounds like it in BindingDB:
Activity Spreadsheet -- Enzyme Inhibition Constant Data from BindingDB
Found 1 hit for monomerid = 3596
TargetEpidermal growth factor receptor(Homo sapiens (Human))
University of Auckland
LigandPNGBDBM3596(4-[(3-Bromophenyl)amino]-7-methoxypyrido[4,3-d]pyr...)
Affinity DataIC50:  39nMpH: 7.4 T: 2°C. Assay description: IC50 is the inhibitor concentration which inhibits 50% of kinase activity that catalyzes the transfer of the terminal phosphate from [gamma-32P] labe...
In DepthDetails ArticlePubMed