BDBM361601 US10221175, Compound 6
SMILES Cn1cc2cc(ccc2n1)-c1cc(F)c(CN2Cc3ccc4nncn4c3C2=O)c(F)c1
InChI Key InChIKey=JSCCYJFJNWMVBS-UHFFFAOYSA-N
Data  1 EC50
  Tab Delimited (TSV)   2D SDfile   Computed 3D by Vconf -m prep SDfile
Find this compound or compounds like it in BindingDB:
Activity Spreadsheet -- Enzyme Inhibition Constant Data from BindingDB
Found 1 hit for monomerid = 361601
TargetMuscarinic acetylcholine receptor M1(Homo sapiens (Human))
Vanderbilt University
US Patent
LigandPNGBDBM361601(US10221175, Compound 6)
Affinity DataEC50:  488nM. Assay description: For high throughput measurement of agonist-evoked increases in intracellular calcium, CHO-K1 cells stably expressing muscarinic receptors were plated...
Ligand InfoPC cidPC sid
In DepthDetails US Patent