BDBM36366 (4-Methylpiperazin-1-yl)-acetic acid (2-hydroxy-benzylidene)-hydrazide, 4::CID5406498
SMILES CN1CCN(CC(=O)N\N=C\c2ccccc2O)CC1
InChI Key InChIKey=JPBCJCBFGXBBQY-XNTDXEJSSA-N
Data  1 EC50
  Tab Delimited (TSV)   2D SDfile   Computed 3D by Vconf -m prep SDfile
Find this compound or compounds like it in BindingDB:
Activity Spreadsheet -- Enzyme Inhibition Constant Data from BindingDB
Found 1 hit for monomerid = 36366
TargetCaspase-3(Homo sapiens (Human))
University of Illinois
LigandPNGBDBM36366((4-Methylpiperazin-1-yl)-acetic acid (2-hydroxy-be...)
Affinity DataEC50: >5.00E+4nMpH: 7.4 T: 2°C. Assay description: Procaspase-3 activation assay; activation of procaspase-3 to caspase-3.
In DepthDetails ArticlePubMed