BDBM36367 (4-Benzylpiperazin-1-yl)-acetic acid ethylidene-hydrazide, 5::CID9543561
SMILES CC=NNC(=O)CN1CCN(Cc2ccccc2)CC1
InChI Key InChIKey=USXHSONNNDIRCZ-UHFFFAOYSA-N
Data  1 EC50
  Tab Delimited (TSV)   2D SDfile   Computed 3D by Vconf -m prep SDfile
Find this compound or compounds like it in BindingDB:
Activity Spreadsheet -- Enzyme Inhibition Constant Data from BindingDB
Found 1 hit for monomerid = 36367
TargetCaspase-3(Homo sapiens (Human))
University of Illinois
LigandPNGBDBM36367((4-Benzylpiperazin-1-yl)-acetic acid ethylidene-hy...)
Affinity DataEC50: >5.00E+4nMpH: 7.4 T: 2°C. Assay description: Procaspase-3 activation assay; activation of procaspase-3 to caspase-3.
In DepthDetails ArticlePubMed