BDBM36383 (1R,4R,5R,7R,8R)-5-(Hydroxymethyl)-2-azabicyclo[2.2.2]octane-4,5,6-triol, 4b::CID10241591
SMILES OC[C@H]1C[C@H]2NC[C@]1(O)[C@H](O)[C@@H]2O
InChI Key InChIKey=KVZFAJCKXADJGT-FMDGEEDCSA-N
Data  1 KI
  Tab Delimited (TSV)   2D SDfile   Computed 3D by Vconf -m prep SDfile
Find this compound or compounds like it in BindingDB:
Activity Spreadsheet -- Enzyme Inhibition Constant Data from BindingDB
Found 1 hit for monomerid = 36383
TargetBeta-mannosidase(Bacteroides thetaiotaomicron)
The Medical School, Newcastle University
LigandPNGBDBM36383((1R,4R,5R,7R,8R)-5-(Hydroxymethyl)-2-azabicyclo[2....)
Affinity DataKi:  5.00E+5nM ΔG°:  -4.68kcal/molepH: 5.6 T: 2°C. Assay description: Putative mannosidase assay using wild-type protein Btman2A. Enzyme inhibition assay.
In DepthDetails ArticlePubMed