BDBM36384 (2R/S,3S,4R,5R)-5-(Hydroxymethyl)piperidine-2,3,4-triol, 5::CID10197840
SMILES OC[C@H]1CNC(O)[C@@H](O)[C@@H]1O
InChI Key InChIKey=BHOYFRIRWXBNHP-VRPWFDPXSA-N
Data  1 KI
  Tab Delimited (TSV)   2D SDfile   Computed 3D by Vconf -m prep SDfile
Find this compound or compounds like it in BindingDB:
Activity Spreadsheet -- Enzyme Inhibition Constant Data from BindingDB
Found 1 hit for monomerid = 36384
TargetBeta-mannosidase(Bacteroides thetaiotaomicron)
The Medical School, Newcastle University
LigandPNGBDBM36384((2R/S,3S,4R,5R)-5-(Hydroxymethyl)piperidine-2,3,4-...)
Affinity DataKi:  975nM ΔG°:  -8.52kcal/molepH: 5.6 T: 2°C. Assay description: Putative mannosidase assay using wild-type protein Btman2A. Enzyme inhibition assay.
Ligand InfoPC cidPC sid
In DepthDetails ArticlePubMed