BDBM36581 Bicyclic core, rac-16
SMILES C[C@@H]1C2[C@@H](N(C)C(C)(C)C2C(=O)N1Cc1ccc2OCOc2c1)c1ccc(cc1)C(N)=N
InChI Key InChIKey=DMANOKXYDMAICQ-ZVIFSSHESA-N
Data  2 KI
  Tab Delimited (TSV)   2D SDfile   Computed 3D by Vconf -m prep SDfile
Find this compound or compounds like it in BindingDB:
Activity Spreadsheet -- Enzyme Inhibition Constant Data from BindingDB
Found 2 hits for monomerid = 36581
TargetProthrombin(Homo sapiens (Human))
Laboratorium FÜR Organische Chemie
LigandPNGBDBM36581(Bicyclic core, rac-16)
Affinity DataKi:  9.20E+3nM. Assay description: Enzyme inhibition assay using thrombin, a trypsin-like serine protease.
In DepthDetails ArticlePubMed
TargetSerine protease 1(Homo sapiens (Human))
Laboratorium FÜR Organische Chemie
LigandPNGBDBM36581(Bicyclic core, rac-16)
Affinity DataKi:  4.00E+4nM. Assay description: Enzyme inhibition assay using thrombin, a trypsin-like serine protease.
In DepthDetails ArticlePubMed