BDBM366048 US9873683, Example 42
SMILES COc1cccc(CCc2nccn2-c2ccc(cc2)N2c3ccc4ccccc4c3NC(=O)CC2=O)c1
InChI Key InChIKey=VUHMRNGAHKHICR-UHFFFAOYSA-N
Data  1 IC50
  Tab Delimited (TSV)   2D SDfile   Computed 3D by Vconf -m prep SDfile
Find this compound or compounds like it in BindingDB:
Activity Spreadsheet -- Enzyme Inhibition Constant Data from BindingDB
Found 1 hit for monomerid = 366048
TargetP2X purinoceptor 4(Homo sapiens (Human))
Nippon Chemiphar
US Patent
LigandPNGBDBM366048(US9873683, Example 42)
Affinity DataIC50:  92nM. Assay description: The 1321N1 cells stably expressing human P2X4 receptor were seeded on a 96-well plate, cultured under the conditions of 37° C. and 5% CO2 for 24 hour...
Ligand InfoPC cidPC sid
In DepthDetails US Patent