BDBM36642 L-809,370
SMILES Oc1ccc2c3CCC=Cc3n(Cc3ccc(cc3)-c3ccccc3-c3nnn[nH]3)c2c1
InChI Key InChIKey=TXRLJXXRBUUONI-UHFFFAOYSA-N
Data  2 IC50
  Tab Delimited (TSV)   2D SDfile   Computed 3D by Vconf -m prep SDfile
Find this compound or compounds like it in BindingDB:
Activity Spreadsheet -- Enzyme Inhibition Constant Data from BindingDB
Found 2 hits for monomerid = 36642
TargetDipeptidase 1(Homo sapiens (Human))
Merck Research Laboratories
LigandPNGBDBM36642(L-809,370)
Affinity DataIC50: >1.00E+5nMpH: 7.0 T: 2°C. Assay description: Enzyme inhibition assay by biphenyl tetrazoles (BPTS)using dehydropeptidase 1 (DPH-1).
In DepthDetails ArticlePubMed
TargetBeta-lactamase(Bacteroides fragilis)
Merck Research Laboratories
LigandPNGBDBM36642(L-809,370)
Affinity DataIC50:  6.00E+3nMpH: 7.0 T: 2°C. Assay description: Enzyme inhibition assay by biphenyl tetrazoles (BPTS)using metallo-beta-lactamase.
In DepthDetails ArticlePubMed