BDBM36788 2-(1 R-isopropyl-2-hydroxyethylamino)-9-isopropylpurine core C6-substituent, 73
SMILES CC(C)[C@H](CO)Nc1nc2N(CNc2c(Nc2ccc(Br)cc2)n1)C(C)C
InChI Key InChIKey=PDTJDQJHJNIUKS-HNNXBMFYSA-N
Data  1 IC50
  Tab Delimited (TSV)   2D SDfile   Computed 3D by Vconf -m prep SDfile
Find this compound or compounds like it in BindingDB:
Activity Spreadsheet -- Enzyme Inhibition Constant Data from BindingDB
Found 1 hit for monomerid = 36788
TargetCyclin-dependent kinase 1(Homo sapiens (Human))
University of California Berkeley
LigandPNGBDBM36788(2-(1 R-isopropyl-2-hydroxyethylamino)-9-isopropylp...)
Affinity DataIC50:  40nM. Assay description: Inhibition assay using CDK1/cyclin B.
In DepthDetails ArticlePubMed