BDBM372465 N-[2-(3,4-Difluoro-benzyl)-2H-[1,2,3]triazol-4-yl]-2-(1,3,3-trimethyl-2-oxo-2,3-dihydro-1H-indol-5-yl)-acetamide::US10246426, Example 19
SMILES CN1C(=O)C(C)(C)c2cc(CC(=O)Nc3cnn(Cc4ccc(F)c(F)c4)n3)ccc12
InChI Key InChIKey=RZCJYWPVOFJZMM-UHFFFAOYSA-N
Data  1 IC50
  Tab Delimited (TSV)   2D SDfile   Computed 3D by Vconf -m prep SDfile
Find this compound or compounds like it in BindingDB:
Activity Spreadsheet -- Enzyme Inhibition Constant Data from BindingDB
Found 1 hit for monomerid = 372465
TargetVoltage-dependent T-type calcium channel subunit alpha-1H(Homo sapiens (Human))
Idorsia Pharmaceuticals
US Patent
LigandPNGBDBM372465(N-[2-(3,4-Difluoro-benzyl)-2H-[1,2,3]triazol-4-yl]...)
Affinity DataIC50:  9.70nM. Assay description: Stock solutions of test compounds are prepared to a concentration of 10 mM in DMSO. For the Cav3.2 assay, serial dilutions of the compounds are prepa...
Ligand InfoPC cidPC sid
In DepthDetails US Patent