BDBM375318 US10358436, Example A39::US9907800, Example A38::US9907800, Example A39
SMILES COc1ccc2NC(=O)[C@@]3(C[C@H]3c3ccc4c(n[nH]c4c3)-c3ccc(cc3)N3CCN(C)CC3)c2c1
InChI Key
Data  13 IC50
  Tab Delimited (TSV)   2D SDfile   Computed 3D by Vconf -m prep SDfile
Find this compound or compounds like it in BindingDB:
Activity Spreadsheet -- Enzyme Inhibition Constant Data from BindingDB
Found 13 hits for monomerid = 375318
TargetSerine/threonine-protein kinase PLK4(Homo sapiens (Human))
University Health Network
US Patent
LigandPNGBDBM375318(US10358436, Example A39 | US9907800, Example A38 |...)
Affinity DataIC50: <100nM. Assay description: PLK4 activity was measured using an indirect ELISA detection system. Dephosphorylated GST-PLK4 (4 nM) was incubated in the presence of 15 μM ATP...
Ligand InfoPC cidPC sid
In DepthDetails US Patent
TargetAurora kinase B(Homo sapiens (Human))
University Health Network
US Patent
LigandPNGBDBM375318(US10358436, Example A39 | US9907800, Example A38 |...)
Affinity DataIC50: <100nM. Assay description: Aurora B inhibition was determined using the Z-Lyte assay kit from Invitrogen. The assay was performed using the recommended manufacturer's instr...
Ligand InfoPC cidPC sid
In DepthDetails US Patent
TargetSerine/threonine-protein kinase PLK4(Homo sapiens (Human))
University Health Network
US Patent
LigandPNGBDBM375318(US10358436, Example A39 | US9907800, Example A38 |...)
Affinity DataIC50: <100nM. Assay description: PLK4 activity was measured using an indirect ELISA detection system. Dephosphorylated GST-PLK4 (4 nM) was incubated in the presence of 15 μM ATP...
Ligand InfoPC cidPC sid
In DepthDetails US Patent
TargetAurora kinase B(Homo sapiens (Human))
University Health Network
US Patent
LigandPNGBDBM375318(US10358436, Example A39 | US9907800, Example A38 |...)
Affinity DataIC50: <100nM. Assay description: Aurora B inhibition was determined using the Z-Lyte assay kit from Invitrogen. The assay was performed using the recommended manufacturer's instr...
Ligand InfoPC cidPC sid
In DepthDetails US Patent
TargetReceptor-type tyrosine-protein kinase FLT3(Homo sapiens (Human))
University Health Network
US Patent
LigandPNGBDBM375318(US10358436, Example A39 | US9907800, Example A38 |...)
Affinity DataIC50: <100nM. Assay description: The enzymatic activity of FLT3 was determined using the Z-Lyte assay kit from Invitrogen (Invitrogen cat #PV3191). The assay was performed using the ...
Ligand InfoPC cidPC sid
In DepthDetails US Patent
TargetSerine/threonine-protein kinase PLK4 [1-391](Homo sapiens (Human))
University Health Network
US Patent
LigandPNGBDBM375318(US10358436, Example A39 | US9907800, Example A38 |...)
Affinity DataIC50: <100nM. Assay description: Active PLK4 was purified from an E. coli expression system as an amino terminal GST fusion of residues 1-391 of human PLK4. The protein was purified ...
Ligand InfoPC cidPC sid
In DepthDetails US Patent
TargetAurora kinase B(Homo sapiens (Human))
University Health Network
US Patent
LigandPNGBDBM375318(US10358436, Example A39 | US9907800, Example A38 |...)
Affinity DataIC50:  6.90nM. Assay description: Inhibition of AURKB (unknown origin)
Ligand InfoPC cidPC sid
In DepthDetails ArticlePubMed
TargetReceptor-type tyrosine-protein kinase FLT3(Homo sapiens (Human))
University Health Network
US Patent
LigandPNGBDBM375318(US10358436, Example A39 | US9907800, Example A38 |...)
Affinity DataIC50: <100nM. Assay description: PLK3 inhibition was determined using the Z-Lyte assay kit from Invitrogen (cat #PV3802). The assay was performed using the recommended manufacturer&#...
Ligand InfoPC cidPC sid
In DepthDetails US Patent
TargetSerine/threonine-protein kinase PLK4(Homo sapiens (Human))
University Health Network
US Patent
LigandPNGBDBM375318(US10358436, Example A39 | US9907800, Example A38 |...)
Affinity DataIC50:  0.940nM. Assay description: Inhibition of PLK4 (unknown origin)
Ligand InfoPC cidPC sid
In DepthDetails ArticlePubMed
TargetReceptor-type tyrosine-protein kinase FLT3(Homo sapiens (Human))
University Health Network
US Patent
LigandPNGBDBM375318(US10358436, Example A39 | US9907800, Example A38 |...)
Affinity DataIC50:  45nM. Assay description: Inhibition of FLT3 (unknown origin)
Ligand InfoPC cidPC sid
In DepthDetails ArticlePubMed
TargetVascular endothelial growth factor receptor 2(Homo sapiens (Human))
Entremed
Curated by ChEMBL
LigandPNGBDBM375318(US10358436, Example A39 | US9907800, Example A38 |...)
Affinity DataIC50:  9.40E+3nM. Assay description: Inhibition of KDR (unknown origin)
Ligand InfoPC cidPC sid
In DepthDetails ArticlePubMed
TargetAurora kinase A(Homo sapiens (Human))
Entremed
Curated by ChEMBL
LigandPNGBDBM375318(US10358436, Example A39 | US9907800, Example A38 |...)
Affinity DataIC50: >1.00E+3nM. Assay description: Inhibition of AURKA (unknown origin)
Ligand InfoPC cidPC sid
In DepthDetails ArticlePubMed
TargetAurora kinase B(Homo sapiens (Human))
University Health Network
US Patent
LigandPNGBDBM375318(US10358436, Example A39 | US9907800, Example A38 |...)
Affinity DataIC50: <100nM. Assay description: Aurora B inhibition was determined using the Z-Lyte assay kit from Invitrogen. The assay was performed using the recommended manufacturer's instr...
Ligand InfoPC cidPC sid
In DepthDetails US Patent