BDBM380478 US9926306, ID 183-84
SMILES Cc1cs\c(=N/C2CCCCC2)n1\N=C\c1cc(O)c(O)c(O)c1
InChI Key InChIKey=BKHGWSRXPKXSQY-LDRVEFRDSA-N
Data  3 IC50
  Tab Delimited (TSV)   2D SDfile   Computed 3D by Vconf -m prep SDfile
Find this compound or compounds like it in BindingDB:
Activity Spreadsheet -- Enzyme Inhibition Constant Data from BindingDB
Found 3 hits for monomerid = 380478
TargetInduced myeloid leukemia cell differentiation protein Mcl-1(Homo sapiens (Human))
University Of Maryland
Curated by ChEMBL
LigandPNGBDBM380478(US9926306, ID 183-84)
Affinity DataIC50:  4.80E+3nM. Assay description: Inhibition of FITC-BID BH3 peptide binding to recombinant GST-tagged N-terminal/C-terminal truncated Mcl-1 (unknown origin) expressed in Escherichia ...
Ligand InfoPC cidPC sid
In DepthDetails ArticlePubMed
TargetInduced myeloid leukemia cell differentiation protein Mcl-1 homolog(Mus musculus (Mouse))
Dana-Farber Cancer Institute
US Patent
LigandPNGBDBM380478(US9926306, ID 183-84)
Affinity DataIC50:  13nM. Assay description: A high-throughput competitive fluorescence polarization (FP) screening assay (Z-factor, 0.62) was developed based on the direct binding interaction b...
Ligand InfoPC cidPC sid
In DepthDetails US Patent
TargetBcl-2-like protein 1(Homo sapiens (Human))
University Of Maryland
Curated by ChEMBL
LigandPNGBDBM380478(US9926306, ID 183-84)
Affinity DataIC50: >5.00E+4nM. Assay description: Inhibition of FITC-BID BH3 peptide binding to recombinant GST-tagged C-terminal truncated Bcl-xL (unknown origin) expressed in Escherichia coli BL21 ...
Ligand InfoPC cidPC sid
In DepthDetails ArticlePubMed