BDBM381877 3-(3-(2,2-Dimethyl-2,3-dihydropyrido[3,2-f][1,4]oxazepin-4(5H)-yl)-2,3-dihydro-1H-inden-5-yl)-3-(7-methoxy-1,4-dimethyl-1H-benzo[d][1,2,3]triazol-5-yl)propanoic Acid, Formic Acid Salt::US10272095, Example 44
SMILES COc1cc(C(CC(O)=O)c2ccc3CCC(N4Cc5cccnc5OC(C)(C)C4)c3c2)c(C)c2nnn(C)c12
InChI Key InChIKey=VTEBYSQHJVBWMW-UHFFFAOYSA-N
Data  1 EC50
  Tab Delimited (TSV)   2D SDfile   Computed 3D by Vconf -m prep SDfile
Find this compound or compounds like it in BindingDB:
Activity Spreadsheet -- Enzyme Inhibition Constant Data from BindingDB
Found 1 hit for monomerid = 381877
TargetNAD(P)H dehydrogenase [quinone] 1(Homo sapiens (Human))
Glaxosmithkline
US Patent
LigandPNGBDBM381877(3-(3-(2,2-Dimethyl-2,3-dihydropyrido[3,2-f][1,4]ox...)
Affinity DataEC50:  5.5nM. Assay description: NAD(P)H:quinone oxidoreductase 1 (NQO1), also called DT diaphorase, is a homodimeric FAD-containing enzyme that catalyzes obligatory NAD(P)H-dependen...
Ligand InfoPC cidPC sid
In DepthDetails US Patent