BDBM381897 3-(1,4-Dimethyl-1H-benzo[d][1,2,3]triazol-5-yl)-2,2-dimethyl-3-(3-((S)-2-methyl-2,3-dihydropyrido[3,2-f][1,4]oxazepin-4(5H)-yl)-2,3-dihydro-1H-inden-5-yl)propanoic Acid, Formic Acid Salt::US10272095, Example 49
SMILES C[C@H]1CN(Cc2cccnc2O1)C1CCc2ccc(cc12)C(c1ccc2n(C)nnc2c1C)C(C)(C)C(O)=O
InChI Key InChIKey=UYUCVMDFPUAPTO-MSRYYJCKSA-N
Data  1 EC50
  Tab Delimited (TSV)   2D SDfile   Computed 3D by Vconf -m prep SDfile
Find this compound or compounds like it in BindingDB:
Activity Spreadsheet -- Enzyme Inhibition Constant Data from BindingDB
Found 1 hit for monomerid = 381897
TargetNAD(P)H dehydrogenase [quinone] 1(Homo sapiens (Human))
Glaxosmithkline
US Patent
LigandPNGBDBM381897(3-(1,4-Dimethyl-1H-benzo[d][1,2,3]triazol-5-yl)-2,...)
Affinity DataEC50:  55nM. Assay description: NAD(P)H:quinone oxidoreductase 1 (NQO1), also called DT diaphorase, is a homodimeric FAD-containing enzyme that catalyzes obligatory NAD(P)H-dependen...
Ligand InfoPC cidPC sid
In DepthDetails US Patent