BDBM381905 3-(1,4-Dimethyl-1H-benzo[d][1,2,3]triazol-5-yl)-3-(3-((2,2-dimethyl-2,3-dihydropyrido[3,2-f][1,4]oxazepin-4(5H)-yl)methyl)-4-methylphenyl)propanoic Acid::US10272095, Example 51
SMILES Cc1c(ccc2n(C)nnc12)C(CC(O)=O)c1ccc2CCC(N3Cc4cccnc4OC(C)(C)C3)c2c1
InChI Key InChIKey=UGPIUYCQZMVOQE-UHFFFAOYSA-N
Data  1 EC50
  Tab Delimited (TSV)   2D SDfile   Computed 3D by Vconf -m prep SDfile
Find this compound or compounds like it in BindingDB:
Activity Spreadsheet -- Enzyme Inhibition Constant Data from BindingDB
Found 1 hit for monomerid = 381905
TargetNAD(P)H dehydrogenase [quinone] 1(Homo sapiens (Human))
Glaxosmithkline
US Patent
LigandPNGBDBM381905(3-(1,4-Dimethyl-1H-benzo[d][1,2,3]triazol-5-yl)-3-...)
Affinity DataEC50:  55nM. Assay description: NAD(P)H:quinone oxidoreductase 1 (NQO1), also called DT diaphorase, is a homodimeric FAD-containing enzyme that catalyzes obligatory NAD(P)H-dependen...
Ligand InfoPC cidPC sid
In DepthDetails US Patent