BDBM393366 3-((3'-Methoxy-[1,1'-biphenyl]-4-yl)methoxy)azetidine-1-carbonitrile::US9963444, Example 67
SMILES COc1cccc(c1)-c1ccc(COC2CN(C2)C#N)cc1
InChI Key InChIKey=XWMIVCPYFUSWCV-UHFFFAOYSA-N
Data  3 IC50
  Tab Delimited (TSV)   2D SDfile   Computed 3D by Vconf -m prep SDfile
Find this compound or compounds like it in BindingDB:
Activity Spreadsheet -- Enzyme Inhibition Constant Data from BindingDB
Found 3 hits for monomerid = 393366
TargetN-acylethanolamine-hydrolyzing acid amidase(Homo sapiens (Human))
Northeastern University
US Patent
LigandPNGBDBM393366(3-((3'-Methoxy-[1,1'-biphenyl]-4-yl)methoxy)azetid...)
Affinity DataIC50:  55nM. Assay description: In order to have an assay method more conducive to high-throughput screening than those published for measuring the NAE hydrolyzing activity of NAAA,...
Ligand InfoPC cidPC sid
In DepthDetails US Patent
TargetN-acylethanolamine-hydrolyzing acid amidase(Homo sapiens (Human))
Northeastern University
US Patent
LigandPNGBDBM393366(3-((3'-Methoxy-[1,1'-biphenyl]-4-yl)methoxy)azetid...)
Affinity DataIC50:  0.900nM. Assay description: Inhibition of NAAA (unknown origin)
Ligand InfoPC cidPC sid
In DepthDetails ArticlePubMed
TargetN-acylethanolamine-hydrolyzing acid amidase(Homo sapiens (Human))
Northeastern University
US Patent
LigandPNGBDBM393366(3-((3'-Methoxy-[1,1'-biphenyl]-4-yl)methoxy)azetid...)
Affinity DataIC50:  0.890nM. Assay description: Inhibition of activated human NAAA using fluorogenic PAMCA and N-4-methylcoumarin as substrate incubated for 90 mins by fluorescence based assay
Ligand InfoPC cidPC sid
In DepthDetails ArticlePubMed