BDBM39650 4-(3-phenyl-1H-1,2,4-triazol-5-yl)-4-azatricyclo[5.2.1.0~2,6~]dec-8-ene-3,5-dione::MLS000539032::SMR000144847::cid_2972429
SMILES [H]C12CC([H])(C=C1)C1C2C(=O)N(C1=O)c1n[nH]c(n1)-c1ccccc1
InChI Key InChIKey=NQUIAPOZNBJGAP-UHFFFAOYSA-N
Data  1 IC50  1 EC50
  Tab Delimited (TSV)   2D SDfile   Computed 3D by Vconf -m prep SDfile
Find this compound or compounds like it in BindingDB:
Activity Spreadsheet -- Enzyme Inhibition Constant Data from BindingDB
Found 2 hits for monomerid = 39650
TargetAlkaline phosphatase, germ cell type(Homo sapiens (Human))
Burnham Center For Chemical Genomics
Curated by PubChem BioAssay
LigandPNGBDBM39650(4-(3-phenyl-1H-1,2,4-triazol-5-yl)-4-azatricyclo[5...)
Affinity DataEC50:  9.99E+5nM. Assay description: Sanford-Burnham Center for Chemical Genomics (SBCCG) Sanford-Burnham Medical Research Institute (SBMRI, San Diego, CA) NIH Molecular Libraries Screen...
In DepthDetails PCBioAssay
TargetAlkaline phosphatase, germ cell type(Homo sapiens (Human))
Burnham Center For Chemical Genomics
Curated by PubChem BioAssay
LigandPNGBDBM39650(4-(3-phenyl-1H-1,2,4-triazol-5-yl)-4-azatricyclo[5...)
Affinity DataIC50:  7.63E+3nM. Assay description: Sanford-Burnham Center for Chemical Genomics (SBCCG) Sanford-Burnham Medical Research Institute (SBMRI, San Diego, CA) NIH Molecular Libraries Screen...
In DepthDetails PCBioAssay