BDBM39691 4-{2-[4-(dimethylamino)phenyl]vinyl}-1-methylpyridinium iodide::MLS000533005::N,N-dimethyl-4-[(E)-2-(1-methyl-4-pyridin-1-iumyl)ethenyl]aniline;iodide::N,N-dimethyl-4-[(E)-2-(1-methylpyridin-1-ium-4-yl)ethenyl]aniline;iodide::SMR000140443::cid_5333955::dimethyl-[4-[(E)-2-(1-methylpyridin-1-ium-4-yl)vinyl]phenyl]amine;iodide
SMILES CN(C)c1ccc(\C=C\c2cc[n+](C)cc2)cc1
InChI Key InChIKey=WVKVDDALQQZUGC-UHFFFAOYSA-N
Data  1 IC50  1 EC50
  Tab Delimited (TSV)   2D SDfile   Computed 3D by Vconf -m prep SDfile
Find this compound or compounds like it in BindingDB:
Activity Spreadsheet -- Enzyme Inhibition Constant Data from BindingDB
Found 2 hits for monomerid = 39691
TargetAlkaline phosphatase, germ cell type(Homo sapiens (Human))
Burnham Center For Chemical Genomics
Curated by PubChem BioAssay
LigandPNGBDBM39691(4-{2-[4-(dimethylamino)phenyl]vinyl}-1-methylpyrid...)
Affinity DataEC50:  9.99E+5nM. Assay description: Sanford-Burnham Center for Chemical Genomics (SBCCG) Sanford-Burnham Medical Research Institute (SBMRI, San Diego, CA) NIH Molecular Libraries Screen...
In DepthDetails PCBioAssay
TargetAlkaline phosphatase, germ cell type(Homo sapiens (Human))
Burnham Center For Chemical Genomics
Curated by PubChem BioAssay
LigandPNGBDBM39691(4-{2-[4-(dimethylamino)phenyl]vinyl}-1-methylpyrid...)
Affinity DataIC50:  1.73E+4nM. Assay description: Sanford-Burnham Center for Chemical Genomics (SBCCG) Sanford-Burnham Medical Research Institute (SBMRI, San Diego, CA) NIH Molecular Libraries Screen...
In DepthDetails PCBioAssay