BDBM40170 9-methyl-2-(methylthio)-5H-thiochromeno[4,3-d]pyrimidine::9-methyl-2-methylsulfanyl-5H-thiochromeno[4,3-d]pyrimidine::MLS000540602::SMR000125860::cid_1488852::methyl 9-methyl-5H-thiochromeno[4,3-d]pyrimidin-2-yl sulfide
SMILES CSc1ncc2CSc3ccc(C)cc3-c2n1
InChI Key InChIKey=PGCFIOPNQHNLHT-UHFFFAOYSA-N
Data  1 IC50
  Tab Delimited (TSV)   2D SDfile   Computed 3D by Vconf -m prep SDfile
Find this compound or compounds like it in BindingDB:
Activity Spreadsheet -- Enzyme Inhibition Constant Data from BindingDB
Found 1 hit for monomerid = 40170
TargetEstrogen receptor(Homo sapiens (Human))
Emory University
Curated by PubChem BioAssay
LigandPNGBDBM40170(9-methyl-2-(methylthio)-5H-thiochromeno[4,3-d]pyri...)
Affinity DataIC50: >5.00E+4nM. Assay description: NIH Molecular Libraries Screening Centers Network [MLSCN] Emory Chemical Biology Discovery Center in MLSCN Assay provider: John A. Katzenellenbogen, ...
In DepthDetails PCBioAssay