BDBM4032 2-{[1,6-dimethyl-3-(phenylcarbamoyl)-1H-indol-2-yl]disulfanyl}-1,6-dimethyl-N-phenyl-1H-indole-3-carboxamide::dithiobis(1H-indole-3-carboxamide) deriv. 10q
SMILES Cc1ccc2c(C(=O)Nc3ccccc3)c(SSc3c(C(=O)Nc4ccccc4)c4ccc(C)cc4n3C)n(C)c2c1
InChI Key InChIKey=RIWLLXKPZKILLE-UHFFFAOYSA-N
Data  3 IC50
  Tab Delimited (TSV)   2D SDfile   Computed 3D by Vconf -m prep SDfile
Find this compound or compounds like it in BindingDB:
Activity Spreadsheet -- Enzyme Inhibition Constant Data from BindingDB
Found 3 hits for monomerid = 4032
TargetEpidermal growth factor receptor(Homo sapiens (Human))
University of Auckland
LigandPNGBDBM4032(2-{[1,6-dimethyl-3-(phenylcarbamoyl)-1H-indol-2-yl...)
Affinity DataIC50: >1.00E+5nM. Assay description: IC50 is the inhibitor concentration which inhibits 50% of kinase activity that catalyzes the transfer of the terminal phosphate from [gamma-32P] labe...
In DepthDetails ArticlePubMed
TargetEpidermal growth factor receptor(Homo sapiens (Human))
University of Auckland
LigandPNGBDBM4032(2-{[1,6-dimethyl-3-(phenylcarbamoyl)-1H-indol-2-yl...)
Affinity DataIC50: >1.00E+5nM. Assay description: Inhibition of EGFR derived from human A-431 cells using copolymer of Glu/Ala/Tyr as substrate by scintillation counting method
In DepthDetails PubMed
TargetTyrosine-protein kinase transforming protein Src(Avian sarcoma virus)
University of Auckland
LigandPNGBDBM4032(2-{[1,6-dimethyl-3-(phenylcarbamoyl)-1H-indol-2-yl...)
Affinity DataIC50:  1.00E+5nM. Assay description: IC50 is the inhibitor concentration which inhibits 50% of kinase activity that catalyzes the transfer of the terminal phosphate from [gamma-32P] labe...
In DepthDetails ArticlePubMed