BDBM412614 N2-(4-(4,5-dimethyl-4H-1,2,4-triazol-3-yl)-2-ethoxyphenyl)-6-methyl-N8-neopentylpyrido[3,4-d]pyrimidine-2,8-diamine::US10399974, Example 7
SMILES CCOc1cc(ccc1Nc1ncc2cc(C)nc(NCC(C)(C)C)c2n1)-c1nnc(C)n1C
InChI Key InChIKey=OMONHEJVJYRTAT-UHFFFAOYSA-N
Data  2 KI  4 IC50
  Tab Delimited (TSV)   2D SDfile   Computed 3D by Vconf -m prep SDfile
Find this compound or compounds like it in BindingDB:
Activity Spreadsheet -- Enzyme Inhibition Constant Data from BindingDB
Found 6 hits for monomerid = 412614
TargetDual specificity protein kinase TTK(Homo sapiens (Human))
The Institute Of Cancer Research
Curated by ChEMBL
LigandPNGBDBM412614(N2-(4-(4,5-dimethyl-4H-1,2,4-triazol-3-yl)-2-ethox...)
Affinity DataKi:  0.120nM. Assay description: Inhibition of full length human N-terminal 6xHis-tagged MPS1 expressed in baculovirus expression system using 5FAM-H236 peptide as substrate after 60...
Ligand Info
In DepthDetails ArticlePubMed
TargetCyclin-A2/Cyclin-dependent kinase 2(Homo sapiens (Human))
The Institute Of Cancer Research
Curated by ChEMBL
LigandPNGBDBM412614(N2-(4-(4,5-dimethyl-4H-1,2,4-triazol-3-yl)-2-ethox...)
Affinity DataKi:  470nM. Assay description: Inhibition of full length human N-terminal His-tagged CDK2/cyclinA expressed in baculovirus expression system using 5FAM- peptide18 as substrate afte...
Ligand Info
In DepthDetails ArticlePubMed
TargetDual specificity protein kinase TTK(Homo sapiens (Human))
The Institute Of Cancer Research
Curated by ChEMBL
LigandPNGBDBM412614(N2-(4-(4,5-dimethyl-4H-1,2,4-triazol-3-yl)-2-ethox...)
Affinity DataIC50:  12nM. Assay description: Inhibition of full length human N-terminal 6xHis-tagged MPS1 expressed in baculovirus expression system using 5FAM-H236 peptide as substrate after 60...
Ligand Info
In DepthDetails ArticlePubMed
TargetCyclin-A2/Cyclin-dependent kinase 2(Homo sapiens (Human))
The Institute Of Cancer Research
Curated by ChEMBL
LigandPNGBDBM412614(N2-(4-(4,5-dimethyl-4H-1,2,4-triazol-3-yl)-2-ethox...)
Affinity DataIC50:  940nM. Assay description: Inhibition of full length human N-terminal His-tagged CDK2/cyclinA expressed in baculovirus expression system using 5FAM- peptide18 as substrate afte...
Ligand Info
In DepthDetails ArticlePubMed
TargetDual specificity protein kinase TTK(Homo sapiens (Human))
The Institute Of Cancer Research
Curated by ChEMBL
LigandPNGBDBM412614(N2-(4-(4,5-dimethyl-4H-1,2,4-triazol-3-yl)-2-ethox...)
Affinity DataIC50:  4nM. Assay description: The enzyme reaction (total volume 10 μl) was carried out in black 384-well low volume plates containing full length MPS1 (12.5 nM or 3 nM), fluo...
Ligand Info
In DepthDetails US Patent
TargetDual specificity protein kinase TTK(Homo sapiens (Human))
The Institute Of Cancer Research
Curated by ChEMBL
LigandPNGBDBM412614(N2-(4-(4,5-dimethyl-4H-1,2,4-triazol-3-yl)-2-ethox...)
Affinity DataIC50:  33nM. Assay description: Inhibition of MPS1 autophosphorylation at Thr33/Ser37 in human HCT116 cells after 2 hrs by MSD assay
Ligand Info
In DepthDetails ArticlePubMed