BDBM418649 N-methyl-4-{[4-({2- [methyl(methylsulfonyl)amino]benzyl} amino)-5-(trifluoromethyl)pyrimidin-2- yl]amino}benzamide (96)::US10450297, Example 96
SMILES CNC(=O)c1ccc(Nc2ncc(c(NCc3ccccc3N(C)S(C)(=O)=O)n2)C(F)(F)F)cc1
InChI Key InChIKey=STYZVQABGOPYRB-UHFFFAOYSA-N
Data  1 IC50
  Tab Delimited (TSV)   2D SDfile   Computed 3D by Vconf -m prep SDfile
Find this compound or compounds like it in BindingDB:
Activity Spreadsheet -- Enzyme Inhibition Constant Data from BindingDB
Found 1 hit for monomerid = 418649
TargetFocal adhesion kinase 1 [410-689](Homo sapiens (Human))
Pfizer
US Patent
LigandPNGBDBM418649(N-methyl-4-{[4-({2- [methyl(methylsulfonyl)amino]b...)
Affinity DataIC50:  0.590nM. Assay description: The in vitro activity of the compounds of the compounds of the invention may be determined by the following procedure. More particularly, the followi...
Ligand InfoPC cidPC sid
In DepthDetails US Patent