BDBM419183 US10457678, Compound 36
SMILES CCOc1ccc(cc1)-c1cc2cccn(C(=O)N3CCN(C)CC3)c2n1
InChI Key InChIKey=LJPWXFOSYFWCPA-UHFFFAOYSA-N
Data  1 EC50
  Tab Delimited (TSV)   2D SDfile   Computed 3D by Vconf -m prep SDfile
Find this compound or compounds like it in BindingDB:
Activity Spreadsheet -- Enzyme Inhibition Constant Data from BindingDB
Found 1 hit for monomerid = 419183
TargetDisintegrin and metalloproteinase domain-containing protein 17(Homo sapiens (Human))
Institut National De La Sante Et De La Recherche Medicale (Inserm)
US Patent
LigandPNGBDBM419183(US10457678, Compound 36)
Affinity DataEC50:  1.05E+3nM. Assay description: TNF-α can induce necroptosis in Jurkat cells (human T lymphocytes) when FADD was deleted. This model was used to screen various libraries of che...
Ligand InfoPC cidPC sid
In DepthDetails US Patent