BDBM42142 MLS000081362::SMR000045431::cid_664517
SMILES [H][C@]12[C@H](N3C=Cc4ccccc4C3[C@@]1([H])C(=O)N(C2=O)c1ccc(C)cc1)C(=O)c1ccco1
InChI Key InChIKey=NKBSAVIPKRSEKM-KORDQABASA-N
Data  7 IC50
  Tab Delimited (TSV)   2D SDfile   Computed 3D by Vconf -m prep SDfile
Find this compound or compounds like it in BindingDB:
Activity Spreadsheet -- Enzyme Inhibition Constant Data from BindingDB
Found 3 hits for monomerid = 42142
TargetTyrosine-protein phosphatase YopH(Yersinia enterocolitica)
University of Pittsburgh
Curated by PubChem BioAssay
LigandPNGBDBM42142(MLS000081362 | SMR000045431 | cid_664517)
Affinity DataIC50: >5.00E+4nM. Assay description: Yersinia pestis is the causal agent of the bubonic plague and, although modern antibiotics are extremely effective against the malady, the plague rem...
In DepthDetails PCBioAssay
TargetTyrosine-protein phosphatase YopH(Yersinia enterocolitica)
University of Pittsburgh
Curated by PubChem BioAssay
LigandPNGBDBM42142(MLS000081362 | SMR000045431 | cid_664517)
Affinity DataIC50: >5.00E+4nM. Assay description: Yersinia pestis is the causal agent of the bubonic plague and, although modern antibiotics are extremely effective against the malady, the plague rem...
In DepthDetails PCBioAssay
TargetTyrosine-protein phosphatase YopH(Yersinia enterocolitica)
University of Pittsburgh
Curated by PubChem BioAssay
LigandPNGBDBM42142(MLS000081362 | SMR000045431 | cid_664517)
Affinity DataIC50: >5.00E+4nM. Assay description: Yersinia pestis is the causal agent of the bubonic plague and, although modern antibiotics are extremely effective against the malady, the plague rem...
In DepthDetails PCBioAssay