BDBM42696 3-phenyl-1H-indazole::MLS000095818::SMR000031366::cid_300385
SMILES c1ccc(cc1)-c1n[nH]c2ccccc12
InChI Key InChIKey=MXBKCOLSUUYOHT-UHFFFAOYSA-N
Data  4 IC50
  Tab Delimited (TSV)   2D SDfile   Computed 3D by Vconf -m prep SDfile
Find this compound or compounds like it in BindingDB:
Activity Spreadsheet -- Enzyme Inhibition Constant Data from BindingDB
Found 4 hits for monomerid = 42696
TargetAlkaline phosphatase, tissue-nonspecific isozyme(Homo sapiens (Human))
Burnham Center For Chemical Genomics
Curated by PubChem BioAssay
LigandPNGBDBM42696(3-phenyl-1H-indazole | MLS000095818 | SMR000031366...)
Affinity DataIC50:  3.72E+3nM. Assay description: Sanford-Burnham Center for Chemical Genomics (SBCCG) Sanford-Burnham Medical Research Institute (SBMRI, San Diego, CA) NIH Molecular Libraries Screen...
In DepthDetails PCBioAssay
TargetDual specificity protein kinase TTK(Homo sapiens (Human))
Shionogi Pharmaceutical Research Center
Curated by ChEMBL
LigandPNGBDBM42696(3-phenyl-1H-indazole | MLS000095818 | SMR000031366...)
Affinity DataIC50:  2.10E+3nM. Assay description: Inhibition of MPS1 (unknown origin) using biotin-labeled AGAGLARHTDDEMTGYVA as substrate after 90 mins by DELFIA
In DepthDetails ArticlePubMed
TargetMitogen-activated protein kinase 10(Homo sapiens (Human))
The Scripps Research Institute Molecular Screening Center
Curated by PubChem BioAssay
LigandPNGBDBM42696(3-phenyl-1H-indazole | MLS000095818 | SMR000031366...)
Affinity DataIC50:  2.34E+3nM. Assay description: Source (MLSCN Center Name): The Scripps Research Institute Molecular Screening Center Affiliation: The Scripps Research Institute, TSRI Assay Provide...
In DepthDetails PCBioAssay
TargetAlkaline phosphatase, tissue-nonspecific isozyme(Homo sapiens (Human))
Burnham Center For Chemical Genomics
Curated by PubChem BioAssay
LigandPNGBDBM42696(3-phenyl-1H-indazole | MLS000095818 | SMR000031366...)
Affinity DataIC50:  3.53E+3nM. Assay description: Sanford-Burnham Center for Chemical Genomics (SBCCG) Sanford-Burnham Medical Research Institute (SBMRI, San Diego, CA) NIH Molecular Libraries Screen...
In DepthDetails PCBioAssay