BDBM42697 (2E)-2-cyano-3-[(3,4,5-trimethoxybenzyl)amino]but-2-enamide::(E)-2-cyano-3-[(3,4,5-trimethoxybenzyl)amino]but-2-enamide::(E)-2-cyano-3-[(3,4,5-trimethoxyphenyl)methylamino]-2-butenamide::(E)-2-cyano-3-[(3,4,5-trimethoxyphenyl)methylamino]but-2-enamide::MLS000089978::SMR000024596::cid_3236465
SMILES COc1cc(CN=C(C)C(C#N)C(N)=O)cc(OC)c1OC
InChI Key InChIKey=YOMYVXXDPAAKHX-UHFFFAOYSA-N
Data  1 IC50
  Tab Delimited (TSV)   2D SDfile   Computed 3D by Vconf -m prep SDfile
Find this compound or compounds like it in BindingDB:
Activity Spreadsheet -- Enzyme Inhibition Constant Data from BindingDB
Found 1 hit for monomerid = 42697
TargetMitogen-activated protein kinase 10(Homo sapiens (Human))
The Scripps Research Institute Molecular Screening Center
Curated by PubChem BioAssay
LigandPNGBDBM42697((2E)-2-cyano-3-[(3,4,5-trimethoxybenzyl)amino]but-...)
Affinity DataIC50:  7.16E+3nM. Assay description: Source (MLSCN Center Name): The Scripps Research Institute Molecular Screening Center Affiliation: The Scripps Research Institute, TSRI Assay Provide...
In DepthDetails PCBioAssay