BDBM42718 MLS000092667::N-(4-acetylphenyl)-3-(3-methoxyphenyl)-2-isoxazoline-5-carboxamide::N-(4-acetylphenyl)-3-(3-methoxyphenyl)-4,5-dihydro-1,2-oxazole-5-carboxamide::N-(4-acetylphenyl)-3-(3-methoxyphenyl)-4,5-dihydroisoxazole-5-carboxamide::N-(4-ethanoylphenyl)-3-(3-methoxyphenyl)-4,5-dihydro-1,2-oxazole-5-carboxamide::SMR000028358::cid_3240978
SMILES COc1cccc(c1)C1=NOC(C1)C(=O)Nc1ccc(cc1)C(C)=O
InChI Key InChIKey=CRFORAJNMDQJTB-UHFFFAOYSA-N
Data  1 IC50
  Tab Delimited (TSV)   2D SDfile   Computed 3D by Vconf -m prep SDfile
Find this compound or compounds like it in BindingDB:
Activity Spreadsheet -- Enzyme Inhibition Constant Data from BindingDB
Found 1 hit for monomerid = 42718
TargetMitogen-activated protein kinase 10(Homo sapiens (Human))
The Scripps Research Institute Molecular Screening Center
Curated by PubChem BioAssay
LigandPNGBDBM42718(MLS000092667 | N-(4-acetylphenyl)-3-(3-methoxyphen...)
Affinity DataIC50:  7.98E+3nM. Assay description: Source (MLSCN Center Name): The Scripps Research Institute Molecular Screening Center Affiliation: The Scripps Research Institute, TSRI Assay Provide...
In DepthDetails PCBioAssay