BDBM42775 6-(2-keto-5-methyl-imidazolidin-4-yl)-N-(p-tolyl)hexanamide::6-(5-methyl-2-oxidanylidene-imidazolidin-4-yl)-N-(4-methylphenyl)hexanamide::6-(5-methyl-2-oxo-4-imidazolidinyl)-N-(4-methylphenyl)hexanamide::6-(5-methyl-2-oxoimidazolidin-4-yl)-N-(4-methylphenyl)hexanamide::MLS000051846::SMR000080943::cid_2972189
SMILES CC1NC(=O)NC1CCCCCC(=O)Nc1ccc(C)cc1
InChI Key InChIKey=TWUHJIAGJSKONL-UHFFFAOYSA-N
Data  2 IC50
  Tab Delimited (TSV)   2D SDfile   Computed 3D by Vconf -m prep SDfile
Find this compound or compounds like it in BindingDB:
Activity Spreadsheet -- Enzyme Inhibition Constant Data from BindingDB
Found 2 hits for monomerid = 42775
TargetTyrosine-protein kinase ABL1(Homo sapiens (Human))
The Scripps Research Institute Molecular Screening Center
Curated by PubChem BioAssay
LigandPNGBDBM42775(6-(2-keto-5-methyl-imidazolidin-4-yl)-N-(p-tolyl)h...)
Affinity DataIC50:  14.5nM. Assay description: Source (MLPCN Center Name): The Scripps Research Institute Molecular Screening Center (SRIMSC) Affiliation: The Scripps Research Institute, TSRI Assa...
In DepthDetails PCBioAssay
TargetMitogen-activated protein kinase 10(Homo sapiens (Human))
The Scripps Research Institute Molecular Screening Center
Curated by PubChem BioAssay
LigandPNGBDBM42775(6-(2-keto-5-methyl-imidazolidin-4-yl)-N-(p-tolyl)h...)
Affinity DataIC50:  1.82E+3nM. Assay description: Source (MLSCN Center Name): The Scripps Research Institute Molecular Screening Center Affiliation: The Scripps Research Institute, TSRI Assay Provide...
In DepthDetails PCBioAssay