BDBM42904 2-(4-chloranyl-3-methyl-phenoxy)-N-(2-pyridin-4-yl-1,3-benzoxazol-5-yl)ethanamide::2-(4-chloro-3-methyl-phenoxy)-N-[2-(4-pyridyl)-1,3-benzoxazol-5-yl]acetamide::2-(4-chloro-3-methylphenoxy)-N-(2-pyridin-4-yl-1,3-benzoxazol-5-yl)acetamide::MLS000040007::SMR000043272::cid_662539
SMILES Cc1cc(OCC(=O)Nc2ccc3oc(nc3c2)-c2ccncc2)ccc1Cl
InChI Key InChIKey=AOJXJQCEZQFXHP-UHFFFAOYSA-N
Data  3 EC50
  Tab Delimited (TSV)   2D SDfile   Computed 3D by Vconf -m prep SDfile
Find this compound or compounds like it in BindingDB:
Activity Spreadsheet -- Enzyme Inhibition Constant Data from BindingDB
Found 3 hits for monomerid = 42904
TargetNuclear receptor coactivator 3(Homo sapiens (Human))
The Scripps Research Institute Molecular Screening Center
Curated by PubChem BioAssay
LigandPNGBDBM42904(2-(4-chloranyl-3-methyl-phenoxy)-N-(2-pyridin-4-yl...)
Affinity DataEC50:  5.06E+4nM. Assay description: Source (MLSCN Center Name): The Scripps Research Institute Molecular Screening Center http://molscreen.florida.scripps.edu/ Center Affiliation: The ...
In DepthDetails PCBioAssay
TargetNuclear receptor coactivator 1(Homo sapiens (Human))
The Scripps Research Institute Molecular Screening Center
Curated by PubChem BioAssay
LigandPNGBDBM42904(2-(4-chloranyl-3-methyl-phenoxy)-N-(2-pyridin-4-yl...)
Affinity DataEC50:  2.48E+4nM. Assay description: Source (MLSCN Center Name): The Scripps Research Institute Molecular Screening Center Center Affiliation: The Scripps Research Institute (TSRI) Assay...
In DepthDetails PCBioAssay
TargetNuclear receptor coactivator 2(Homo sapiens (Human))
The Scripps Research Institute Molecular Screening Center
Curated by PubChem BioAssay
LigandPNGBDBM42904(2-(4-chloranyl-3-methyl-phenoxy)-N-(2-pyridin-4-yl...)
Affinity DataEC50:  2.53E+4nM. Assay description: Source (MLSCN Center Name): The Scripps Research Institute Molecular Screening Center Center Affiliation: The Scripps Research Institute (TSRI) Assay...
In DepthDetails PCBioAssay