BDBM4291 (2-Oxo-3-indolinidene)malononitrile::2-(2-oxo-2,3-dihydro-1H-indol-3-ylidene)propanedinitrile::CHEMBL293798::Tyrphostin deriv. 22
SMILES O=[#6]1-[#7]-c2ccccc2\[#6]-1=[#6](/C#N)C#N
InChI Key InChIKey=IXRCJYBQPZJHRZ-UHFFFAOYSA-N
Data  3 IC50
  Tab Delimited (TSV)   2D SDfile   Computed 3D by Vconf -m prep SDfile
Find this compound or compounds like it in BindingDB:
Activity Spreadsheet -- Enzyme Inhibition Constant Data from BindingDB
Found 1 hit for monomerid = 4291
TargetEpidermal growth factor receptor(Homo sapiens (Human))
Hebrew University of Jerusalem
LigandPNGBDBM4291((2-Oxo-3-indolinidene)malononitrile | 2-(2-oxo-2,3...)
Affinity DataIC50: >2.50E+5nM. Assay description: The activity of EGFR, preactivated with EGF, is measured by its ability to transfer terminal phosphate from [gamma-32P]ATP to poly(GAT) substrate.
In DepthDetails ArticlePubMed