BDBM43139 6-methyl-5-[2-(thiophen-2-ylmethylidene)hydrazinyl]-2H-1,2,4-triazin-3-one::6-methyl-5-[N'-(2-thenylidene)hydrazino]-2H-1,2,4-triazin-3-one::MLS000682887::SMR000312970::cid_2789677::thiophene-2-carbaldehyde (6-methyl-3-oxo-2,3-dihydro-1,2,4-triazin-5-yl)hydrazone
SMILES Cc1nnc(=O)[nH]c1N=NCc1cccs1
InChI Key InChIKey=YSBLINDQHSHFBA-UHFFFAOYSA-N
Data  1 IC50  3 EC50
  Tab Delimited (TSV)   2D SDfile   Computed 3D by Vconf -m prep SDfile
Find this compound or compounds like it in BindingDB:
Activity Spreadsheet -- Enzyme Inhibition Constant Data from BindingDB
Found 4 hits for monomerid = 43139
TargetNuclear receptor coactivator 2(Homo sapiens (Human))
The Scripps Research Institute Molecular Screening Center
Curated by PubChem BioAssay
LigandPNGBDBM43139(6-methyl-5-[2-(thiophen-2-ylmethylidene)hydrazinyl...)
Affinity DataEC50: >7.94E+4nM. Assay description: Source (MLSCN Center Name): The Scripps Research Institute Molecular Screening Center Center Affiliation: The Scripps Research Institute (TSRI) Assay...
Ligand InfoPC cidPC sid
In DepthDetails PCBioAssay
TargetM1 family aminopeptidase(Plasmodium falciparum (isolate FcB1 / Columbia))
Srmlsc
Curated by PubChem BioAssay
LigandPNGBDBM43139(6-methyl-5-[2-(thiophen-2-ylmethylidene)hydrazinyl...)
Affinity DataIC50:  2.58E+4nM. Assay description: Southern Research Molecular Libraries Screening Center (SRMLSC) Southern Research Institute (Birmingham, Alabama) NIH Molecular Libraries Screening...
Ligand InfoPC cidPC sid
In DepthDetails PCBioAssay
TargetNuclear receptor coactivator 3(Homo sapiens (Human))
The Scripps Research Institute Molecular Screening Center
Curated by PubChem BioAssay
LigandPNGBDBM43139(6-methyl-5-[2-(thiophen-2-ylmethylidene)hydrazinyl...)
Affinity DataEC50: >7.94E+4nM. Assay description: Source (MLSCN Center Name): The Scripps Research Institute Molecular Screening Center http://molscreen.florida.scripps.edu/ Center Affiliation: The ...
Ligand InfoPC cidPC sid
In DepthDetails PCBioAssay
TargetNuclear receptor coactivator 1(Homo sapiens (Human))
The Scripps Research Institute Molecular Screening Center
Curated by PubChem BioAssay
LigandPNGBDBM43139(6-methyl-5-[2-(thiophen-2-ylmethylidene)hydrazinyl...)
Affinity DataEC50: >7.94E+4nM. Assay description: Source (MLSCN Center Name): The Scripps Research Institute Molecular Screening Center Center Affiliation: The Scripps Research Institute (TSRI) Assay...
Ligand InfoPC cidPC sid
In DepthDetails PCBioAssay