BDBM43143 1,3-dimethyl-7-[2-(3,4,5,6-tetrahydro-2H-azepin-7-ylamino)ethyl]purine-2,6-dione;hydrochloride::1,3-dimethyl-7-[2-(3,4,5,6-tetrahydro-2H-azepin-7-ylamino)ethyl]xanthine;hydrochloride::7-[2-(2-azepanylideneamino)ethyl]-1,3-dimethyl-3,7-dihydro-1H-purine-2,6-dione hydrochloride::MLS000672515::SMR000295373::cid_2965238
SMILES Cn1c2ncn(CCN=C3CCCCCN3)c2c(=O)n(C)c1=O
InChI Key InChIKey=QDNUXYCWZSDOGV-UHFFFAOYSA-N
Data  3 EC50
  Tab Delimited (TSV)   2D SDfile   Computed 3D by Vconf -m prep SDfile
Find this compound or compounds like it in BindingDB:
Activity Spreadsheet -- Enzyme Inhibition Constant Data from BindingDB
Found 3 hits for monomerid = 43143
TargetNuclear receptor coactivator 2(Homo sapiens (Human))
The Scripps Research Institute Molecular Screening Center
Curated by PubChem BioAssay
LigandPNGBDBM43143(1,3-dimethyl-7-[2-(3,4,5,6-tetrahydro-2H-azepin-7-...)
Affinity DataEC50: >7.94E+4nM. Assay description: Source (MLSCN Center Name): The Scripps Research Institute Molecular Screening Center Center Affiliation: The Scripps Research Institute (TSRI) Assay...
Ligand InfoPC cidPC sid
In DepthDetails PCBioAssay
TargetNuclear receptor coactivator 3(Homo sapiens (Human))
The Scripps Research Institute Molecular Screening Center
Curated by PubChem BioAssay
LigandPNGBDBM43143(1,3-dimethyl-7-[2-(3,4,5,6-tetrahydro-2H-azepin-7-...)
Affinity DataEC50: >7.94E+4nM. Assay description: Source (MLSCN Center Name): The Scripps Research Institute Molecular Screening Center http://molscreen.florida.scripps.edu/ Center Affiliation: The ...
Ligand InfoPC cidPC sid
In DepthDetails PCBioAssay
TargetNuclear receptor coactivator 1(Homo sapiens (Human))
The Scripps Research Institute Molecular Screening Center
Curated by PubChem BioAssay
LigandPNGBDBM43143(1,3-dimethyl-7-[2-(3,4,5,6-tetrahydro-2H-azepin-7-...)
Affinity DataEC50: >7.94E+4nM. Assay description: Source (MLSCN Center Name): The Scripps Research Institute Molecular Screening Center Center Affiliation: The Scripps Research Institute (TSRI) Assay...
Ligand InfoPC cidPC sid
In DepthDetails PCBioAssay