BDBM43152 4-(4-{[4-cyclohexyl-3-(2-hydroxyethyl)piperazin-1-yl]methyl}phenyl)-2-methylbut-3-yn-2-ol::4-[4-[[4-cyclohexyl-3-(2-hydroxyethyl)-1-piperazinyl]methyl]phenyl]-2-methyl-3-butyn-2-ol::4-[4-[[4-cyclohexyl-3-(2-hydroxyethyl)piperazin-1-yl]methyl]phenyl]-2-methyl-but-3-yn-2-ol::4-[4-[[4-cyclohexyl-3-(2-hydroxyethyl)piperazin-1-yl]methyl]phenyl]-2-methylbut-3-yn-2-ol::4-[4-[[4-cyclohexyl-3-(2-hydroxyethyl)piperazino]methyl]phenyl]-2-methyl-but-3-yn-2-ol::MLS000734364::SMR000317200::cid_16190992
SMILES CC(C)(O)C#Cc1ccc(CN2CCN(C(CCO)C2)C2CCCCC2)cc1
InChI Key InChIKey=IVTUZADYGBIAHW-UHFFFAOYSA-N
Data  1 IC50  3 EC50
  Tab Delimited (TSV)   2D SDfile   Computed 3D by Vconf -m prep SDfile
Find this compound or compounds like it in BindingDB:
Activity Spreadsheet -- Enzyme Inhibition Constant Data from BindingDB
Found 4 hits for monomerid = 43152
TargetNuclear receptor coactivator 2(Homo sapiens (Human))
The Scripps Research Institute Molecular Screening Center
Curated by PubChem BioAssay
LigandPNGBDBM43152(4-(4-{[4-cyclohexyl-3-(2-hydroxyethyl)piperazin-1-...)
Affinity DataEC50: >7.94E+4nM. Assay description: Source (MLSCN Center Name): The Scripps Research Institute Molecular Screening Center Center Affiliation: The Scripps Research Institute (TSRI) Assay...
In DepthDetails PCBioAssay
TargetInduced myeloid leukemia cell differentiation protein Mcl-1(Homo sapiens (Human))
Emory University
Curated by PubChem BioAssay
LigandPNGBDBM43152(4-(4-{[4-cyclohexyl-3-(2-hydroxyethyl)piperazin-1-...)
Affinity DataIC50:  2.12E+4nM. Assay description: NIH Molecular Libraries Screening Centers Network [MLSCN] Emory Chemical Biology Discovery Center in MLSCN Assay provider: Nikolovska-Coleska, Univer...
In DepthDetails PCBioAssay
TargetNuclear receptor coactivator 3(Homo sapiens (Human))
The Scripps Research Institute Molecular Screening Center
Curated by PubChem BioAssay
LigandPNGBDBM43152(4-(4-{[4-cyclohexyl-3-(2-hydroxyethyl)piperazin-1-...)
Affinity DataEC50: >7.94E+4nM. Assay description: Source (MLSCN Center Name): The Scripps Research Institute Molecular Screening Center http://molscreen.florida.scripps.edu/ Center Affiliation: The ...
In DepthDetails PCBioAssay
TargetNuclear receptor coactivator 1(Homo sapiens (Human))
The Scripps Research Institute Molecular Screening Center
Curated by PubChem BioAssay
LigandPNGBDBM43152(4-(4-{[4-cyclohexyl-3-(2-hydroxyethyl)piperazin-1-...)
Affinity DataEC50: >7.94E+4nM. Assay description: Source (MLSCN Center Name): The Scripps Research Institute Molecular Screening Center Center Affiliation: The Scripps Research Institute (TSRI) Assay...
In DepthDetails PCBioAssay