BDBM43154 1-{3-[1-(cyclohex-1-en-1-ylcarbonyl)piperidin-3-yl]propanoyl}-4-pyridin-2-ylpiperazine::3-[1-(cyclohexen-1-ylcarbonyl)piperidin-3-yl]-1-(4-pyridin-2-ylpiperazin-1-yl)propan-1-one::3-[1-(cyclohexene-1-carbonyl)-3-piperidyl]-1-[4-(2-pyridyl)piperazino]propan-1-one::3-[1-(cyclohexene-1-carbonyl)piperidin-3-yl]-1-(4-pyridin-2-ylpiperazin-1-yl)propan-1-one::3-[1-[1-cyclohexenyl(oxo)methyl]-3-piperidinyl]-1-[4-(2-pyridinyl)-1-piperazinyl]-1-propanone::MLS000735909::SMR000317007::cid_16191146
SMILES O=C(CCC1CCCN(C1)C(=O)C1=CCCCC1)N1CCN(CC1)c1ccccn1
InChI Key InChIKey=YEZHJFKPYKQBHQ-UHFFFAOYSA-N
Data  3 EC50
  Tab Delimited (TSV)   2D SDfile   Computed 3D by Vconf -m prep SDfile
Find this compound or compounds like it in BindingDB:
Activity Spreadsheet -- Enzyme Inhibition Constant Data from BindingDB
Found 3 hits for monomerid = 43154
TargetNuclear receptor coactivator 2(Homo sapiens (Human))
The Scripps Research Institute Molecular Screening Center
Curated by PubChem BioAssay
LigandPNGBDBM43154(1-{3-[1-(cyclohex-1-en-1-ylcarbonyl)piperidin-3-yl...)
Affinity DataEC50: >7.94E+4nM. Assay description: Source (MLSCN Center Name): The Scripps Research Institute Molecular Screening Center Center Affiliation: The Scripps Research Institute (TSRI) Assay...
In DepthDetails PCBioAssay
TargetNuclear receptor coactivator 3(Homo sapiens (Human))
The Scripps Research Institute Molecular Screening Center
Curated by PubChem BioAssay
LigandPNGBDBM43154(1-{3-[1-(cyclohex-1-en-1-ylcarbonyl)piperidin-3-yl...)
Affinity DataEC50: >7.94E+4nM. Assay description: Source (MLSCN Center Name): The Scripps Research Institute Molecular Screening Center http://molscreen.florida.scripps.edu/ Center Affiliation: The ...
In DepthDetails PCBioAssay
TargetNuclear receptor coactivator 1(Homo sapiens (Human))
The Scripps Research Institute Molecular Screening Center
Curated by PubChem BioAssay
LigandPNGBDBM43154(1-{3-[1-(cyclohex-1-en-1-ylcarbonyl)piperidin-3-yl...)
Affinity DataEC50: >7.94E+4nM. Assay description: Source (MLSCN Center Name): The Scripps Research Institute Molecular Screening Center Center Affiliation: The Scripps Research Institute (TSRI) Assay...
In DepthDetails PCBioAssay