BDBM43168 2-(4-hydroxyphenyl)-1H-indene-1,3(2H)-dione::2-(4-hydroxyphenyl)indane-1,3-quinone::2-(4-hydroxyphenyl)indene-1,3-dione::MLS000681627::SMR000312311::cid_350421
SMILES Oc1ccc(cc1)C1C(=O)c2ccccc2C1=O
InChI Key InChIKey=VTQJAXNKAJABAA-UHFFFAOYSA-N
Data  3 EC50
  Tab Delimited (TSV)   2D SDfile   Computed 3D by Vconf -m prep SDfile
Find this compound or compounds like it in BindingDB:
Activity Spreadsheet -- Enzyme Inhibition Constant Data from BindingDB
Found 3 hits for monomerid = 43168
TargetNuclear receptor coactivator 2(Homo sapiens (Human))
The Scripps Research Institute Molecular Screening Center
Curated by PubChem BioAssay
LigandPNGBDBM43168(2-(4-hydroxyphenyl)-1H-indene-1,3(2H)-dione | 2-(4...)
Affinity DataEC50: >7.94E+4nM. Assay description: Source (MLSCN Center Name): The Scripps Research Institute Molecular Screening Center Center Affiliation: The Scripps Research Institute (TSRI) Assay...
In DepthDetails PCBioAssay
TargetNuclear receptor coactivator 3(Homo sapiens (Human))
The Scripps Research Institute Molecular Screening Center
Curated by PubChem BioAssay
LigandPNGBDBM43168(2-(4-hydroxyphenyl)-1H-indene-1,3(2H)-dione | 2-(4...)
Affinity DataEC50: >7.94E+4nM. Assay description: Source (MLSCN Center Name): The Scripps Research Institute Molecular Screening Center http://molscreen.florida.scripps.edu/ Center Affiliation: The ...
In DepthDetails PCBioAssay
TargetNuclear receptor coactivator 1(Homo sapiens (Human))
The Scripps Research Institute Molecular Screening Center
Curated by PubChem BioAssay
LigandPNGBDBM43168(2-(4-hydroxyphenyl)-1H-indene-1,3(2H)-dione | 2-(4...)
Affinity DataEC50: >7.94E+4nM. Assay description: Source (MLSCN Center Name): The Scripps Research Institute Molecular Screening Center Center Affiliation: The Scripps Research Institute (TSRI) Assay...
In DepthDetails PCBioAssay