BDBM43173 4-chloranyl-N-[(2-piperidin-1-yl-1,3-thiazol-5-yl)methylideneamino]benzamide::4-chloro-N'-[(E)-(2-piperidino-1,3-thiazol-5-yl)methylidene]benzenecarbohydrazide::4-chloro-N-[(2-piperidin-1-yl-1,3-thiazol-5-yl)methylideneamino]benzamide::4-chloro-N-[(2-piperidinothiazol-5-yl)methyleneamino]benzamide::4-chloro-N-[[2-(1-piperidinyl)-5-thiazolyl]methylideneamino]benzamide::MLS000721072::SMR000335252::cid_1474669
SMILES Clc1ccc(cc1)C(=O)NN=Cc1cnc(s1)N1CCCCC1
InChI Key InChIKey=BXAPMVCILZEKLM-UHFFFAOYSA-N
Data  3 EC50
  Tab Delimited (TSV)   2D SDfile   Computed 3D by Vconf -m prep SDfile
Find this compound or compounds like it in BindingDB:
Activity Spreadsheet -- Enzyme Inhibition Constant Data from BindingDB
Found 3 hits for monomerid = 43173
TargetNuclear receptor coactivator 2(Homo sapiens (Human))
The Scripps Research Institute Molecular Screening Center
Curated by PubChem BioAssay
LigandPNGBDBM43173(4-chloranyl-N-[(2-piperidin-1-yl-1,3-thiazol-5-yl)...)
Affinity DataEC50: >7.94E+4nM. Assay description: Source (MLSCN Center Name): The Scripps Research Institute Molecular Screening Center Center Affiliation: The Scripps Research Institute (TSRI) Assay...
In DepthDetails PCBioAssay
TargetNuclear receptor coactivator 3(Homo sapiens (Human))
The Scripps Research Institute Molecular Screening Center
Curated by PubChem BioAssay
LigandPNGBDBM43173(4-chloranyl-N-[(2-piperidin-1-yl-1,3-thiazol-5-yl)...)
Affinity DataEC50: >7.94E+4nM. Assay description: Source (MLSCN Center Name): The Scripps Research Institute Molecular Screening Center http://molscreen.florida.scripps.edu/ Center Affiliation: The ...
In DepthDetails PCBioAssay
TargetNuclear receptor coactivator 1(Homo sapiens (Human))
The Scripps Research Institute Molecular Screening Center
Curated by PubChem BioAssay
LigandPNGBDBM43173(4-chloranyl-N-[(2-piperidin-1-yl-1,3-thiazol-5-yl)...)
Affinity DataEC50: >7.94E+4nM. Assay description: Source (MLSCN Center Name): The Scripps Research Institute Molecular Screening Center Center Affiliation: The Scripps Research Institute (TSRI) Assay...
In DepthDetails PCBioAssay