BDBM43178 5-bromanyl-2-methoxy-N-[(4-nitrophenyl)methylideneamino]benzamide::5-bromo-2-methoxy-N'-[(1E)-(4-nitrophenyl)methylene]benzohydrazide::5-bromo-2-methoxy-N-[(4-nitrobenzylidene)amino]benzamide::5-bromo-2-methoxy-N-[(4-nitrophenyl)methylideneamino]benzamide::MLS000723752::SMR000305347::cid_16195311
SMILES COc1ccc(Br)cc1C(=O)N\N=C\c1ccc(cc1)[N+]([O-])=O
InChI Key InChIKey=WZOUDNOILSMWED-RQZCQDPDSA-N
Data  3 EC50
  Tab Delimited (TSV)   2D SDfile   Computed 3D by Vconf -m prep SDfile
Find this compound or compounds like it in BindingDB:
Activity Spreadsheet -- Enzyme Inhibition Constant Data from BindingDB
Found 3 hits for monomerid = 43178
TargetNuclear receptor coactivator 2(Homo sapiens (Human))
The Scripps Research Institute Molecular Screening Center
Curated by PubChem BioAssay
LigandPNGBDBM43178(5-bromanyl-2-methoxy-N-[(4-nitrophenyl)methylidene...)
Affinity DataEC50: >7.94E+4nM. Assay description: Source (MLSCN Center Name): The Scripps Research Institute Molecular Screening Center Center Affiliation: The Scripps Research Institute (TSRI) Assay...
In DepthDetails PCBioAssay
TargetNuclear receptor coactivator 3(Homo sapiens (Human))
The Scripps Research Institute Molecular Screening Center
Curated by PubChem BioAssay
LigandPNGBDBM43178(5-bromanyl-2-methoxy-N-[(4-nitrophenyl)methylidene...)
Affinity DataEC50: >7.94E+4nM. Assay description: Source (MLSCN Center Name): The Scripps Research Institute Molecular Screening Center http://molscreen.florida.scripps.edu/ Center Affiliation: The ...
In DepthDetails PCBioAssay
TargetNuclear receptor coactivator 1(Homo sapiens (Human))
The Scripps Research Institute Molecular Screening Center
Curated by PubChem BioAssay
LigandPNGBDBM43178(5-bromanyl-2-methoxy-N-[(4-nitrophenyl)methylidene...)
Affinity DataEC50: >7.94E+4nM. Assay description: Source (MLSCN Center Name): The Scripps Research Institute Molecular Screening Center Center Affiliation: The Scripps Research Institute (TSRI) Assay...
In DepthDetails PCBioAssay