BDBM43555 2-(4-methyl-2-quinazolinyl)-1-phenylguanidine::2-(4-methylquinazolin-2-yl)-1-phenyl-guanidine::2-(4-methylquinazolin-2-yl)-1-phenylguanidine::MLS000037979::SMR000040214::cid_659193
SMILES Cc1nc(NC(N)=Nc2ccccc2)nc2ccccc12
InChI Key InChIKey=YLFBDKSRAOAFDC-UHFFFAOYSA-N
Data  1 IC50  1 EC50
  Tab Delimited (TSV)   2D SDfile   Computed 3D by Vconf -m prep SDfile
Find this compound or compounds like it in BindingDB:
Activity Spreadsheet -- Enzyme Inhibition Constant Data from BindingDB
Found 2 hits for monomerid = 43555
TargetSignal transducer and activator of transcription 1-alpha/beta(Homo sapiens (Human))
The Scripps Research Institute Molecular Screening Center
Curated by PubChem BioAssay
LigandPNGBDBM43555(2-(4-methyl-2-quinazolinyl)-1-phenylguanidine | 2-...)
Affinity DataEC50: >5.57E+4nM. Assay description: Source (MLPCN Center Name): The Scripps Research Institute Molecular Screening Center Center Affiliation: The Scripps Research Institute (TSRI) Assay...
Ligand InfoPC cidPC sid
In DepthDetails PCBioAssay
TargetSignal transducer and activator of transcription 3 [702-738,740-752](Homo sapiens (Human))
The Scripps Research Institute Molecular Screening Center
Curated by PubChem BioAssay
LigandPNGBDBM43555(2-(4-methyl-2-quinazolinyl)-1-phenylguanidine | 2-...)
Affinity DataIC50:  2.11E+3nM. Assay description: Source (MLPCN Center Name): The Scripps Research Institute Molecular Screening Center Center Affiliation: The Scripps Research Institute (TSRI) Assay...
Ligand InfoPC cidPC sid
In DepthDetails PCBioAssay