BDBM43570 1-[2-(4-methyl-1-piperidinyl)-2-oxoethyl]-3-(2-phenylethyl)quinazoline-2,4-dione::1-[2-(4-methylpiperidin-1-yl)-2-oxidanylidene-ethyl]-3-(2-phenylethyl)quinazoline-2,4-dione::1-[2-(4-methylpiperidin-1-yl)-2-oxoethyl]-3-(2-phenylethyl)quinazoline-2,4(1H,3H)-dione::1-[2-(4-methylpiperidin-1-yl)-2-oxoethyl]-3-(2-phenylethyl)quinazoline-2,4-dione::1-[2-keto-2-(4-methylpiperidino)ethyl]-3-phenethyl-quinazoline-2,4-quinone::MLS000090618::SMR000025222::cid_3243982
SMILES CC1CCN(CC1)C(=O)Cn1c2ccccc2c(=O)n(CCc2ccccc2)c1=O
InChI Key InChIKey=CORHXMTYKYUHJX-UHFFFAOYSA-N
Data  1 IC50  1 EC50
  Tab Delimited (TSV)   2D SDfile   Computed 3D by Vconf -m prep SDfile
Find this compound or compounds like it in BindingDB:
Activity Spreadsheet -- Enzyme Inhibition Constant Data from BindingDB
Found 2 hits for monomerid = 43570
TargetSignal transducer and activator of transcription 1-alpha/beta(Homo sapiens (Human))
The Scripps Research Institute Molecular Screening Center
Curated by PubChem BioAssay
LigandPNGBDBM43570(1-[2-(4-methyl-1-piperidinyl)-2-oxoethyl]-3-(2-phe...)
Affinity DataEC50: >5.57E+4nM. Assay description: Source (MLPCN Center Name): The Scripps Research Institute Molecular Screening Center Center Affiliation: The Scripps Research Institute (TSRI) Assay...
Ligand InfoPC cidPC sid
In DepthDetails PCBioAssay
TargetSignal transducer and activator of transcription 3 [702-738,740-752](Homo sapiens (Human))
The Scripps Research Institute Molecular Screening Center
Curated by PubChem BioAssay
LigandPNGBDBM43570(1-[2-(4-methyl-1-piperidinyl)-2-oxoethyl]-3-(2-phe...)
Affinity DataIC50: >5.57E+4nM. Assay description: Source (MLPCN Center Name): The Scripps Research Institute Molecular Screening Center Center Affiliation: The Scripps Research Institute (TSRI) Assay...
Ligand InfoPC cidPC sid
In DepthDetails PCBioAssay