BDBM4419 4-Anilidoquinazoline deriv. 35b::N-(3-chlorophenyl)-6,7-dimethoxy-2-(4-phenylpiperazin-1-yl)quinazolin-4-amine
SMILES COc1cc2nc(nc(Nc3cccc(Cl)c3)c2cc1OC)N1CCN(CC1)c1ccccc1
InChI Key InChIKey=ISUCGPXEDXWPBD-UHFFFAOYSA-N
Data  1 IC50
  Tab Delimited (TSV)   2D SDfile   Computed 3D by Vconf -m prep SDfile
Find this compound or compounds like it in BindingDB:
Activity Spreadsheet -- Enzyme Inhibition Constant Data from BindingDB
Found 1 hit for monomerid = 4419
TargetEpidermal growth factor receptor(Homo sapiens (Human))
Hebrew University of Jerusalem
LigandPNGBDBM4419(4-Anilidoquinazoline deriv. 35b | N-(3-chloropheny...)
Affinity DataIC50: >5.00E+4nM. Assay description: The activity of EGFR, preactivated with EGF, is measured by its ability to transfer terminal phosphate from [gamma-32P]ATP to poly(GAT) substrate.
In DepthDetails ArticlePubMed