BDBM445252 US10669235, Example 43::US11208381, Example 43
SMILES COC(=O)c1cc2NC(=O)\C(=C(/Nc3ccc(cc3)C(=O)N3CCC4(CC3)N(C)CCCNC4=O)c3ccccc3)c2cc1C
InChI Key InChIKey=URKLHKCMUZBPEN-FLWNBWAVSA-N
Data  12 KI
  Tab Delimited (TSV)   2D SDfile   Computed 3D by Vconf -m prep SDfile
Find this compound or compounds like it in BindingDB:
Activity Spreadsheet -- Enzyme Inhibition Constant Data from BindingDB
Found 12 hits for monomerid = 445252
TargetVascular endothelial growth factor receptor 2(Homo sapiens (Human))
Respivert
US Patent
LigandPNGBDBM445252(US10669235, Example 43 | US11208381, Example 43)
Affinity DataKi:  11.9nM. Assay description: The inhibitory activities of compounds of the invention against VEGFR2 (VEGFR2 Kinase Enzyme System: Promega), were evaluated by mixing the VEGFR2 pr...
Ligand InfoPC cidPC sid
In DepthDetails US Patent
TargetVascular endothelial growth factor receptor 2(Homo sapiens (Human))
Respivert
US Patent
LigandPNGBDBM445252(US10669235, Example 43 | US11208381, Example 43)
Affinity DataKi:  11.9nM. Assay description: Assay was performed in buffer containing 40 mM Tris pH 7.5, 20 mM MgCl2, 0.1 mg/mL BSA and 1 mM DTT. The inhibitory activities of compounds of the in...
Ligand InfoPC cidPC sid
In DepthDetails US Patent
TargetFibroblast growth factor receptor 3(Homo sapiens (Human))
Respivert
US Patent
LigandPNGBDBM445252(US10669235, Example 43 | US11208381, Example 43)
Affinity DataKi:  20.7nM. Assay description: The inhibitory activities of compounds of the invention against FGFR3 (FGFR3 Kinase Enzyme System: Promega), were evaluated by mixing the FGFR3 prote...
Ligand InfoPC cidPC sid
In DepthDetails US Patent
TargetFibroblast growth factor receptor 3(Homo sapiens (Human))
Respivert
US Patent
LigandPNGBDBM445252(US10669235, Example 43 | US11208381, Example 43)
Affinity DataKi:  20.7nM. Assay description: Assay was performed in buffer containing 40 mM Tris pH 7.5, 20 mM MgCl2, 0.1 mg/mL BSA, 1 mM DTT and 2 mM MnCl2. The inhibitory activities of compoun...
Ligand InfoPC cidPC sid
In DepthDetails US Patent
TargetPlatelet-derived growth factor receptor beta(Homo sapiens (Human))
Respivert
US Patent
LigandPNGBDBM445252(US10669235, Example 43 | US11208381, Example 43)
Affinity DataKi:  25.2nM. Assay description: The inhibitory activities of compounds of the invention against PDGFRβ (PDGFRβ Kinase Enzyme System: Promega), were evaluated by mixing the...
Ligand InfoPC cidPC sid
In DepthDetails US Patent
TargetPlatelet-derived growth factor receptor beta(Homo sapiens (Human))
Respivert
US Patent
LigandPNGBDBM445252(US10669235, Example 43 | US11208381, Example 43)
Affinity DataKi:  25.2nM. Assay description: Assay was performed in buffer containing 40 mM Tris pH 7.5, 20 mM MgCl2, 0.1 mg/mL BSA and 1 mM DTT. The inhibitory activities of compounds of the in...
Ligand InfoPC cidPC sid
In DepthDetails US Patent
TargetPlatelet-derived growth factor receptor alpha(Homo sapiens (Human))
Respivert
US Patent
LigandPNGBDBM445252(US10669235, Example 43 | US11208381, Example 43)
Affinity DataKi:  30.8nM. Assay description: The inhibitory activities of compounds of the invention against PDGFRα (PDGFRα Kinase Enzyme System: Promega), were evaluated by mixing the...
Ligand InfoPC cidPC sid
In DepthDetails US Patent
TargetPlatelet-derived growth factor receptor alpha(Homo sapiens (Human))
Respivert
US Patent
LigandPNGBDBM445252(US10669235, Example 43 | US11208381, Example 43)
Affinity DataKi:  30.8nM. Assay description: Assay was performed in buffer containing 40 mM Tris pH 7.5, 20 mM MgCl2, 0.1 mg/mL BSA and 1 mM DTT. The inhibitory activities of compounds of the in...
Ligand InfoPC cidPC sid
In DepthDetails US Patent
TargetVascular endothelial growth factor receptor 1(Homo sapiens (Human))
Respivert
US Patent
LigandPNGBDBM445252(US10669235, Example 43 | US11208381, Example 43)
Affinity DataKi:  66.9nM. Assay description: The inhibitory activities of compounds of the invention against VEGFR1 (VEGFR1 Kinase Enzyme System: Promega), were evaluated by mixing the VEGFR1 pr...
Ligand InfoPC cidPC sid
In DepthDetails US Patent
TargetVascular endothelial growth factor receptor 1(Homo sapiens (Human))
Respivert
US Patent
LigandPNGBDBM445252(US10669235, Example 43 | US11208381, Example 43)
Affinity DataKi:  66.9nM. Assay description: Assay was performed in buffer containing 40 mM Tris pH 7.5, 20 mM MgCl2, 0.1 mg/mL BSA, 1 mM DTT and 2 mM MnCl2. The inhibitory activities of compoun...
Ligand InfoPC cidPC sid
In DepthDetails US Patent
TargetFibroblast growth factor receptor 1(Homo sapiens (Human))
Respivert
US Patent
LigandPNGBDBM445252(US10669235, Example 43 | US11208381, Example 43)
Affinity DataKi:  112nM. Assay description: The inhibitory activities of compounds of the invention against FGFR1 (FGFR1 Kinase Enzyme System: Promega), were evaluated by mixing the FGFR1 prote...
Ligand InfoPC cidPC sid
In DepthDetails US Patent
TargetFibroblast growth factor receptor 1(Homo sapiens (Human))
Respivert
US Patent
LigandPNGBDBM445252(US10669235, Example 43 | US11208381, Example 43)
Affinity DataKi:  112nM. Assay description: Assay was performed in buffer containing 40 mM Tris pH 7.5, 20 mM MgCl2, 0.1 mg/mL BSA and 1 mM DTT. The inhibitory activities of compounds of the in...
Ligand InfoPC cidPC sid
In DepthDetails US Patent