BDBM445675 Ex. 13/KM-06-66/(I-13)::US10683309, Example 13::US11028104, Example 13
SMILES CCn1c2nc(Cc3cn4nc(C)sc4n3)n(Cc3ccccc3)c2c(=O)[nH]c1=O
InChI Key InChIKey=RMUJKYXKGUURTR-UHFFFAOYSA-N
Data  4 IC50
  Tab Delimited (TSV)   2D SDfile   Computed 3D by Vconf -m prep SDfile
Find this compound or compounds like it in BindingDB:
Activity Spreadsheet -- Enzyme Inhibition Constant Data from BindingDB
Found 4 hits for monomerid = 445675
TargetTryptophan 5-hydroxylase 1(Homo sapiens (Human))
Max-DelbrÜCk-Centrum FÜR Molekulare Medizin
US Patent
LigandPNGBDBM445675(Ex. 13/KM-06-66/(I-13) | US10683309, Example 13 | ...)
Affinity DataIC50:  213nM. Assay description: The full-length coding sequences of human TPH1 and TPH2 were PCR amplified, ligated into a MBP fusion vector (pMalc2x, New England Biolabs, MA, USA) ...
Ligand InfoPC cidPC sid
In DepthDetails US Patent
TargetTryptophan 5-hydroxylase 2(Homo sapiens (Human))
Max-DelbrÜCk-Centrum FÜR Molekulare Medizin
US Patent
LigandPNGBDBM445675(Ex. 13/KM-06-66/(I-13) | US10683309, Example 13 | ...)
Affinity DataIC50:  18nM. Assay description: The full-length coding sequences of human TPH1 and TPH2 were PCR amplified, ligated into a MBP fusion vector (pMalc2x, New England Biolabs, MA, USA) ...
Ligand InfoPC cidPC sid
In DepthDetails US Patent
TargetTryptophan 5-hydroxylase 1(Homo sapiens (Human))
Max-DelbrÜCk-Centrum FÜR Molekulare Medizin
US Patent
LigandPNGBDBM445675(Ex. 13/KM-06-66/(I-13) | US10683309, Example 13 | ...)
Affinity DataIC50:  213nM. Assay description: The full-length coding sequences of human TPH1 and TPH2 were PCR amplified, ligated into a MBP fusion vector (pMalc2x, New England Biolabs, MA, USA) ...
Ligand InfoPC cidPC sid
In DepthDetails US Patent
TargetTryptophan 5-hydroxylase 2(Homo sapiens (Human))
Max-DelbrÜCk-Centrum FÜR Molekulare Medizin
US Patent
LigandPNGBDBM445675(Ex. 13/KM-06-66/(I-13) | US10683309, Example 13 | ...)
Affinity DataIC50:  18nM. Assay description: The full-length coding sequences of human TPH1 and TPH2 were PCR amplified, ligated into a MBP fusion vector (pMalc2x, New England Biolabs, MA, USA) ...
Ligand InfoPC cidPC sid
In DepthDetails US Patent