BDBM451152 US10676499, Example 41
SMILES Nc1nc([O-])c2[n+](Cc3cccc(c3)C(=O)Oc3c(Cl)cccc3Cl)cn([C@H]3O[C@@H](COP(O)(O)=O)[C@H](O)[C@@H]3O)c2n1
InChI Key InChIKey=XIOTWTUIFYLOKG-JVGYHMDPSA-N
Data  1 KI  1 Kd
  Tab Delimited (TSV)   2D SDfile   Computed 3D by Vconf -m prep SDfile
Find this compound or compounds like it in BindingDB:
Activity Spreadsheet -- Enzyme Inhibition Constant Data from BindingDB
Found 2 hits for monomerid = 451152
TargetEukaryotic translation initiation factor 4E(Homo sapiens (Human))
Novartis
US Patent
LigandPNGBDBM451152(US10676499, Example 41)
Affinity DataKi:  8.82E+3nM. Assay description: Dual histidine and Avi tagged human EIF4E (His6-3C-avi-eIF4E) was expressed in 8 L of TB Media. Induction by 0.4 mM IPTG occurred at 2.0 OD600, and c...
Ligand InfoPC cidPC sid
In DepthDetails US Patent
TargetEukaryotic translation initiation factor 4E(Homo sapiens (Human))
Novartis
US Patent
LigandPNGBDBM451152(US10676499, Example 41)
Affinity DataKd:  20nM. Assay description: A subset of compounds was further characterized to determine dissociation constants using thermodynamic (Steady State Affinity) binding analysis.
Ligand InfoPC cidPC sid
In DepthDetails US Patent